Target
Cannabinoid receptor 1
Ligand
BDBM76078
Substrate
Meas. Tech.
SAR analysis of antagonists of the Cannabinoid Receptor 1 using an Image-Based Assay - Set 4
IC50
352±n/a nM
Citation
 PubChem, PC SAR analysis of antagonists of the Cannabinoid Receptor 1 using an Image-Based Assay - Set 4 PubChem Bioassay (2010)[AID] 
Target
Name:
Cannabinoid receptor 1
Synonyms:
CANN6 CB-R CNR CNR1_HUMAN Cannabinoid receptor Cannabinoid receptor 1 (brain)
Type:
G Protein-Coupled Receptor (GPCR)
Mol. Mass.:
52868.96
Organism:
Homo sapiens (Human)
Description:
P21554
Residue:
472
  
Inhibitor
Name:
BDBM76078
Synonyms:
MLS-0205133.0001 N-[4-(diethylsulfamoyl)phenyl]-2-phenyl-cinchoninamide N-[4-(diethylsulfamoyl)phenyl]-2-phenylquinoline-4-carboxamide | cid_1306259
Type:
Small organic molecule
Emp. Form.:
C26H25N3O3S
Mol. Mass.:
459.56
SMILES:
CCN(CC)S(=O)(=O)c1ccc(NC(=O)c2cc(nc3ccccc23)-c2ccccc2)cc1
: