Target
Cannabinoid receptor 1
Ligand
BDBM76090
Substrate
Meas. Tech.
SAR analysis of antagonists of the Cannabinoid Receptor 1 using an Image-Based Assay - Set 4
IC50
474±n/a nM
Citation
 PubChem, PC SAR analysis of antagonists of the Cannabinoid Receptor 1 using an Image-Based Assay - Set 4 PubChem Bioassay (2010)[AID] 
Target
Name:
Cannabinoid receptor 1
Synonyms:
CANN6 CB-R CNR CNR1_HUMAN Cannabinoid receptor Cannabinoid receptor 1 (brain)
Type:
G Protein-Coupled Receptor (GPCR)
Mol. Mass.:
52868.96
Organism:
Homo sapiens (Human)
Description:
P21554
Residue:
472
  
Inhibitor
Name:
BDBM76090
Synonyms:
2-[4-(4-tert-butylphenyl)-5-phenyl-1,2-dihydropyrazol-3-ylidene]benzimidazole MLS-0437225.0001 | cid_9466417
Type:
Small organic molecule
Emp. Form.:
C26H24N4
Mol. Mass.:
392.4956
SMILES:
CC(C)(C)c1ccc(cc1)-c1c(n[nH]c1-c1ccccc1)-c1nc2ccccc2[nH]1
: