Target
G-protein coupled receptor 35
Ligand
BDBM76058
Substrate
Meas. Tech.
SAR analysis of Agonists of the GPR35 Receptor using an Image-Based Assay - Set 4
EC50
>32000±n/a nM
Citation
 PubChem, PC SAR analysis of Agonists of the GPR35 Receptor using an Image-Based Assay - Set 4 PubChem Bioassay (2010)[AID] 
Target
Name:
G-protein coupled receptor 35
Synonyms:
G protein-coupled receptor 35 GPR35_HUMAN
Type:
Enzyme Catalytic Domain
Mol. Mass.:
34085.57
Organism:
Homo sapiens (Human)
Description:
gi_33695097
Residue:
309
  
Inhibitor
Name:
BDBM76058
Synonyms:
3-[1-[1-(4-methoxyphenyl)cyclopropanecarbonyl]-4-piperidyl]-5-phenyl-1,3,4-oxadiazol-2-one 3-[1-[1-(4-methoxyphenyl)cyclopropyl]carbonylpiperidin-4-yl]-5-phenyl-1,3,4-oxadiazol-2-one MLS-0367705.0001 | cid_23612550
Type:
Small organic molecule
Emp. Form.:
C24H25N3O4
Mol. Mass.:
419.473
SMILES:
COc1ccc(cc1)C1(CC1)C(=O)N1CCC(CC1)n1nc(oc1=O)-c1ccccc1
: