Target
G-protein coupled receptor 55
Ligand
BDBM76035
Substrate
Meas. Tech.
SAR Analysis of Selective Antagonists of GPR55 using an Image-Based Assay - Set 4
IC50
21500±n/a nM
Citation
 PubChem, PC SAR Analysis of Selective Antagonists of GPR55 using an Image-Based Assay - Set 4 PubChem Bioassay (2010)[AID] 
Target
Name:
G-protein coupled receptor 55
Synonyms:
G protein-coupled receptor 55 GPR55_HUMAN
Type:
PROTEIN
Mol. Mass.:
36649.72
Organism:
Homo sapiens (Human)
Description:
ChEMBL_1292265
Residue:
319
  
Inhibitor
Name:
BDBM76035
Synonyms:
MLS-0437134.0001 [4-(2,7-dimethyl-5,6,7,8-tetrahydro-[1]benzothiolo[2,3-d]pyrimidin-4-yl)piperazin-1-yl]-phenyl-methanone [4-(2,7-dimethyl-5,6,7,8-tetrahydrobenzothiopheno[2,3-d]pyrimidin-4-yl)piperazino]-phenyl-methanone | cid_3193015
Type:
Small organic molecule
Emp. Form.:
C23H26N4OS
Mol. Mass.:
406.544
SMILES:
CC1CCc2c(C1)sc1nc(C)nc(N3CCN(CC3)C(=O)c3ccccc3)c21
: