Target
G-protein coupled receptor 55
Ligand
BDBM76057
Substrate
Meas. Tech.
SAR Analysis of Selective Antagonists of GPR55 using an Image-Based Assay - Set 4
IC50
>32000±n/a nM
Citation
 PubChem, PC SAR Analysis of Selective Antagonists of GPR55 using an Image-Based Assay - Set 4 PubChem Bioassay (2010)[AID] 
Target
Name:
G-protein coupled receptor 55
Synonyms:
G protein-coupled receptor 55 GPR55_HUMAN
Type:
PROTEIN
Mol. Mass.:
36649.72
Organism:
Homo sapiens (Human)
Description:
ChEMBL_1292265
Residue:
319
  
Inhibitor
Name:
BDBM76057
Synonyms:
3-[1-[2-(1,3-benzodioxol-5-yl)-1-oxoethyl]-4-piperidinyl]-5-phenyl-1,3,4-oxadiazol-2-one 3-[1-[2-(1,3-benzodioxol-5-yl)acetyl]piperidin-4-yl]-5-phenyl-1,3,4-oxadiazol-2-one MLS-0437153.0001 | cid_23612548
Type:
Small organic molecule
Emp. Form.:
C22H21N3O5
Mol. Mass.:
407.4192
SMILES:
O=C(Cc1ccc2OCOc2c1)N1CCC(CC1)n1nc(oc1=O)-c1ccccc1
: