Target
G-protein coupled receptor 55
Ligand
BDBM76077
Substrate
Meas. Tech.
SAR Analysis of Selective Antagonists of GPR55 using an Image-Based Assay - Set 4
IC50
2950±n/a nM
Citation
 PubChem, PC SAR Analysis of Selective Antagonists of GPR55 using an Image-Based Assay - Set 4 PubChem Bioassay (2010)[AID] 
Target
Name:
G-protein coupled receptor 55
Synonyms:
G protein-coupled receptor 55 GPR55_HUMAN
Type:
PROTEIN
Mol. Mass.:
36649.72
Organism:
Homo sapiens (Human)
Description:
ChEMBL_1292265
Residue:
319
  
Inhibitor
Name:
BDBM76077
Synonyms:
(4Z)-3-hydroxy-4-[4-phenyl-5-(trifluoromethyl)-1,2-dihydropyrazol-3-ylidene]-1-cyclohexa-2,5-dienone (4Z)-3-hydroxy-4-[4-phenyl-5-(trifluoromethyl)-3-pyrazolin-3-ylidene]cyclohexa-2,5-dien-1-one MLS-0289747.0001 | cid_5423235
Type:
Small organic molecule
Emp. Form.:
C16H11F3N2O2
Mol. Mass.:
320.2659
SMILES:
Oc1ccc(-c2n[nH]c(c2-c2ccccc2)C(F)(F)F)c(O)c1
: