Target
Apelin receptor
Ligand
BDBM50061921
Substrate
Meas. Tech.
Dose Response confirmation of uHTS hits from a small molecule agonists of the APJ receptor via a luminescent beta-arrestin assay
EC50
>100000±n/a nM
Citation
 PubChem, PC Dose Response confirmation of uHTS hits from a small molecule agonists of the APJ receptor via a luminescent beta-arrestin assay PubChem Bioassay (2010)[AID] 
Target
Name:
Apelin receptor
Synonyms:
AGTRL1 APJ_HUMAN Angiotensin receptor-like 1 Apelin receptor (APJ) G-protein coupled receptor HG11
Type:
Enzyme Catalytic Domain
Mol. Mass.:
42664.06
Organism:
Homo sapiens (Human)
Description:
P35414
Residue:
380
  
Inhibitor
Name:
BDBM50061921
Synonyms:
4-Methyl-N-(4-phenyl-thiazol-2-yl)-benzenesulfonamide cid_748055
Type:
Small organic molecule
Emp. Form.:
C16H14N2O2S2
Mol. Mass.:
330.425
SMILES:
Cc1ccc(cc1)S(=O)(=O)Nc1nc(cs1)-c1ccccc1
: