Target
Apelin receptor
Ligand
BDBM76135
Substrate
Meas. Tech.
Dose Response confirmation of uHTS hits from a small molecule agonists of the APJ receptor via a luminescent beta-arrestin assay
EC50
>100000±n/a nM
Citation
 PubChem, PC Dose Response confirmation of uHTS hits from a small molecule agonists of the APJ receptor via a luminescent beta-arrestin assay PubChem Bioassay (2010)[AID] 
Target
Name:
Apelin receptor
Synonyms:
AGTRL1 APJ_HUMAN Angiotensin receptor-like 1 Apelin receptor (APJ) G-protein coupled receptor HG11
Type:
Enzyme Catalytic Domain
Mol. Mass.:
42664.06
Organism:
Homo sapiens (Human)
Description:
P35414
Residue:
380
  
Inhibitor
Name:
BDBM76135
Synonyms:
MLS001030861 N-[2-(diethylamino)ethyl]-6-(4-methylpiperidin-1-yl)sulfonyl-2-pyridin-3-ylquinoline-4-carboxamide N-[2-(diethylamino)ethyl]-6-[(4-methyl-1-piperidinyl)sulfonyl]-2-(3-pyridinyl)-4-quinolinecarboxamide cid_20968585
Type:
Small organic molecule
Emp. Form.:
C27H35N5O3S
Mol. Mass.:
509.664
SMILES:
CCN(CC)CCNC(=O)c1cc(nc2ccc(cc12)S(=O)(=O)N1CCC(C)CC1)-c1cccnc1
: