Target
Intestinal-type alkaline phosphatase 1
Ligand
BDBM50606
Substrate
Meas. Tech.
Dose Response concentration confirmation of uHTS hits from a small molecule activators of mouse intestinal alkaline phosphatase via a luminescent assay
EC50
59300±n/a nM
Citation
 PubChem, PC Dose Response concentration confirmation of uHTS hits from a small molecule activators of mouse intestinal alkaline phosphatase via a luminescent assay PubChem Bioassay (2010)[AID] 
Target
Name:
Intestinal-type alkaline phosphatase 1
Synonyms:
Alpi | PPBI1_RAT
Type:
Enzyme Catalytic Domain
Mol. Mass.:
58396.39
Organism:
Rattus norvegicus (Rat)
Description:
P15693
Residue:
540
  
Inhibitor
Name:
BDBM50606
Synonyms:
5-amino-6-[(Z)-(3-hydroxy-4-keto-cyclohexa-2,5-dien-1-ylidene)methyl]-3-phenyl-thiazolo[3,2-a]pyrimidin-7-one 5-amino-6-[(Z)-(3-hydroxy-4-oxocyclohexa-2,5-dien-1-ylidene)methyl]-3-phenyl-[1,3]thiazolo[3,2-a]pyrimidin-7-one 6-[1-(3,4-Dihydroxy-phenyl)-meth-(Z)-ylidene]-5-imino-3-phenyl-5,6-dihydro-thiazolo[3,2-a]pyrimidin-7-o ne SMR000414271 | cid_16681968
Type:
Small organic molecule
Emp. Form.:
C19H13N3O3S
Mol. Mass.:
363.39
SMILES:
Nc1c(\C=C2\C=CC(=O)C(O)=C2)c(=O)nc2scc(-c3ccccc3)n12
: