Target
Intestinal-type alkaline phosphatase 1
Ligand
BDBM76174
Substrate
Meas. Tech.
Dose Response confirmation of uHTS hits from a small molecule inhibitors of mouse intestinal alkaline phosphatase via a luminescent assay
IC50
13700±n/a nM
Citation
 PubChem, PC Dose Response confirmation of uHTS hits from a small molecule inhibitors of mouse intestinal alkaline phosphatase via a luminescent assay PubChem Bioassay (2010)[AID] 
Target
Name:
Intestinal-type alkaline phosphatase 1
Synonyms:
Alpi | PPBI1_RAT
Type:
Enzyme Catalytic Domain
Mol. Mass.:
58396.39
Organism:
Rattus norvegicus (Rat)
Description:
P15693
Residue:
540
  
Inhibitor
Name:
BDBM76174
Synonyms:
1-(3,5-dimethoxyphenyl)-3-(3,3-diphenylpropyl)thiourea N-(3,5-dimethoxyphenyl)-N'-(3,3-diphenylpropyl)thiourea cid_1323304
Type:
Small organic molecule
Emp. Form.:
C24H26N2O2S
Mol. Mass.:
406.54
SMILES:
COc1cc(NC(=S)NCCC(c2ccccc2)c2ccccc2)cc(OC)c1
: