Target
Intestinal-type alkaline phosphatase 1
Ligand
BDBM59326
Substrate
Meas. Tech.
Dose Response confirmation of uHTS hits from a small molecule inhibitors of mouse intestinal alkaline phosphatase via a luminescent assay
IC50
3340±n/a nM
Citation
 PubChem, PC Dose Response confirmation of uHTS hits from a small molecule inhibitors of mouse intestinal alkaline phosphatase via a luminescent assay PubChem Bioassay (2010)[AID] 
Target
Name:
Intestinal-type alkaline phosphatase 1
Synonyms:
Alpi | PPBI1_RAT
Type:
Enzyme Catalytic Domain
Mol. Mass.:
58396.39
Organism:
Rattus norvegicus (Rat)
Description:
P15693
Residue:
540
  
Inhibitor
Name:
BDBM59326
Synonyms:
1-(2,4-dimethylphenyl)-2-(4-methyl-6-piperidin-1-yl-pyrimidin-2-yl)guanidine 1-(2,4-dimethylphenyl)-2-(4-methyl-6-piperidino-pyrimidin-2-yl)guanidine MLS000678345 cid_9595162
Type:
Small organic molecule
Emp. Form.:
C19H26N6
Mol. Mass.:
338.4499
SMILES:
Cc1ccc(NC(N)=Nc2nc(C)cc(n2)N2CCCCC2)c(C)c1
: