Target
Intestinal-type alkaline phosphatase 1
Ligand
BDBM60881
Substrate
Meas. Tech.
Dose Response confirmation of uHTS hits from a small molecule inhibitors of mouse intestinal alkaline phosphatase via a luminescent assay
IC50
24600±n/a nM
Citation
 PubChem, PC Dose Response confirmation of uHTS hits from a small molecule inhibitors of mouse intestinal alkaline phosphatase via a luminescent assay PubChem Bioassay (2010)[AID] 
Target
Name:
Intestinal-type alkaline phosphatase 1
Synonyms:
Alpi | PPBI1_RAT
Type:
Enzyme Catalytic Domain
Mol. Mass.:
58396.39
Organism:
Rattus norvegicus (Rat)
Description:
P15693
Residue:
540
  
Inhibitor
Name:
BDBM60881
Synonyms:
MLS001205093 N-[5-[2-[2-[(Z)-(3-hydroxy-4-oxocyclohexa-2,5-dien-1-ylidene)methyl]hydrazinyl]-2-oxoethyl]-1,3,4-thiadiazol-2-yl]benzamide N-[5-[2-[[(Z)-(3-hydroxy-4-oxo-1-cyclohexa-2,5-dienylidene)methyl]hydrazo]-2-oxoethyl]-1,3,4-thiadiazol-2-yl]benzamide SMR000513872 | cid_5720679
Type:
Small organic molecule
Emp. Form.:
C18H15N5O4S
Mol. Mass.:
397.408
SMILES:
Oc1ccc(C=NNC(=O)Cc2nnc(NC(=O)c3ccccc3)s2)cc1O
: