Target
Intestinal-type alkaline phosphatase 1
Ligand
BDBM76213
Substrate
Meas. Tech.
Dose Response confirmation of uHTS hits from a small molecule inhibitors of mouse intestinal alkaline phosphatase via a luminescent assay
IC50
13900±n/a nM
Citation
 PubChem, PC Dose Response confirmation of uHTS hits from a small molecule inhibitors of mouse intestinal alkaline phosphatase via a luminescent assay PubChem Bioassay (2010)[AID] 
Target
Name:
Intestinal-type alkaline phosphatase 1
Synonyms:
Alpi | PPBI1_RAT
Type:
Enzyme Catalytic Domain
Mol. Mass.:
58396.39
Organism:
Rattus norvegicus (Rat)
Description:
P15693
Residue:
540
  
Inhibitor
Name:
BDBM76213
Synonyms:
3-[(2-keto-3H-1,3-benzoxazol-6-yl)sulfonylamino]-N-m-anisyl-propionamide MLS001096075 N-[(3-methoxyphenyl)methyl]-3-[(2-oxo-3H-1,3-benzoxazol-6-yl)sulfonylamino]propanamide cid_24790974
Type:
Small organic molecule
Emp. Form.:
C18H19N3O6S
Mol. Mass.:
405.425
SMILES:
COc1cccc(CNC(=O)CCNS(=O)(=O)c2ccc3[nH]c(=O)oc3c2)c1
: