Target
Intestinal-type alkaline phosphatase 1
Ligand
BDBM76217
Substrate
Meas. Tech.
Dose Response confirmation of uHTS hits from a small molecule inhibitors of mouse intestinal alkaline phosphatase via a luminescent assay
IC50
2490±n/a nM
Citation
 PubChem, PC Dose Response confirmation of uHTS hits from a small molecule inhibitors of mouse intestinal alkaline phosphatase via a luminescent assay PubChem Bioassay (2010)[AID] 
Target
Name:
Intestinal-type alkaline phosphatase 1
Synonyms:
Alpi | PPBI1_RAT
Type:
Enzyme Catalytic Domain
Mol. Mass.:
58396.39
Organism:
Rattus norvegicus (Rat)
Description:
P15693
Residue:
540
  
Inhibitor
Name:
BDBM76217
Synonyms:
MLS001096114 N-(2,5-dimethoxyphenyl)-3-[(2-oxidanylidene-3H-1,3-benzoxazol-6-yl)sulfonylamino]propanamide SMR000631041 | cid_24790986
Type:
Small organic molecule
Emp. Form.:
C18H19N3O7S
Mol. Mass.:
421.424
SMILES:
COc1ccc(OC)c(NC(=O)CCNS(=O)(=O)c2ccc3[nH]c(=O)oc3c2)c1
: