Target
Intestinal-type alkaline phosphatase 1
Ligand
BDBM76247
Substrate
Meas. Tech.
Dose Response confirmation of uHTS hits from a small molecule inhibitors of mouse intestinal alkaline phosphatase via a luminescent assay
IC50
7210±n/a nM
Citation
 PubChem, PC Dose Response confirmation of uHTS hits from a small molecule inhibitors of mouse intestinal alkaline phosphatase via a luminescent assay PubChem Bioassay (2010)[AID] 
Target
Name:
Intestinal-type alkaline phosphatase 1
Synonyms:
Alpi | PPBI1_RAT
Type:
Enzyme Catalytic Domain
Mol. Mass.:
58396.39
Organism:
Rattus norvegicus (Rat)
Description:
P15693
Residue:
540
  
Inhibitor
Name:
BDBM76247
Synonyms:
MLS002472883 [(2R,3S)-2,8-bis(4-hydroxyphenyl)-3,5-bis(oxidanyl)-3,4,8,9-tetrahydro-2H-furo[2,3-h]chromen-9-yl]-[2,4,6-tris(oxidanyl)phenyl]methanone [(2R,3S)-3,5-dihydroxy-2,8-bis(4-hydroxyphenyl)-3,4,8,9-tetrahydro-2H-furo[2,3-h]chromen-9-yl]-(2,4,6-trihydroxyphenyl)methanone dihydrodaphnodorin B
Type:
Small organic molecule
Emp. Form.:
C30H24O10
Mol. Mass.:
544.5056
SMILES:
O[C@H]1Cc2c(O)cc3OC(C(C(=O)c4c(O)cc(O)cc4O)c3c2O[C@@H]1c1ccc(O)cc1)c1ccc(O)cc1
: