Target
Intestinal-type alkaline phosphatase
Ligand
BDBM39724
Substrate
Meas. Tech.
Dose Response confirmation of uHTS hits from a small molecule inhibitors of human intestinal alkaline phosphatase via a luminescent assay - Set 2
IC50
23400±n/a nM
Citation
 PubChem, PC Dose Response confirmation of uHTS hits from a small molecule inhibitors of human intestinal alkaline phosphatase via a luminescent assay - Set 2 PubChem Bioassay (2010)[AID] 
Target
Name:
Intestinal-type alkaline phosphatase
Synonyms:
ALPI Intestinal alkaline phosphatase | PPBI_HUMAN
Type:
PROTEIN
Mol. Mass.:
56804.94
Organism:
Homo sapiens (Human)
Description:
ChEMBL_1278525
Residue:
528
  
Inhibitor
Name:
BDBM39724
Synonyms:
4-(2-benzylsulfanylethyl)pyridine;phosphoric acid 4-[2-(benzylthio)ethyl]pyridine;phosphoric acid 4-[2-(phenylmethylthio)ethyl]pyridine;phosphoric acid SMR000137553 | cid_2827182
Type:
Small organic molecule
Emp. Form.:
C14H15NS
Mol. Mass.:
229.341
SMILES:
C(Cc1ccncc1)SCc1ccccc1
: