Target
Intestinal-type alkaline phosphatase
Ligand
BDBM75749
Substrate
Meas. Tech.
Dose Response confirmation of uHTS hits from a small molecule inhibitors of human intestinal alkaline phosphatase via a luminescent assay - Set 2
IC50
2360±n/a nM
Citation
 PubChem, PC Dose Response confirmation of uHTS hits from a small molecule inhibitors of human intestinal alkaline phosphatase via a luminescent assay - Set 2 PubChem Bioassay (2010)[AID] 
Target
Name:
Intestinal-type alkaline phosphatase
Synonyms:
ALPI Intestinal alkaline phosphatase | PPBI_HUMAN
Type:
PROTEIN
Mol. Mass.:
56804.94
Organism:
Homo sapiens (Human)
Description:
ChEMBL_1278525
Residue:
528
  
Inhibitor
Name:
BDBM75749
Synonyms:
2-[4-(2-hydroxyethyl)-3-methyl-5-oxo-2,5-dihydro-1H-pyrazol-1-yl]-6-phenyl-4(3H)-pyrimidinone 2-[4-(2-hydroxyethyl)-5-methyl-3-oxidanylidene-1H-pyrazol-2-yl]-6-phenyl-1H-pyrimidin-4-one MLS000736229 cid_379752
Type:
Small organic molecule
Emp. Form.:
C16H16N4O3
Mol. Mass.:
312.3232
SMILES:
Cc1[nH]n(-c2nc(cc(=O)[nH]2)-c2ccccc2)c(=O)c1CCO
: