Target
Intestinal-type alkaline phosphatase
Ligand
BDBM75759
Substrate
Meas. Tech.
Dose Response confirmation of uHTS hits from a small molecule inhibitors of human intestinal alkaline phosphatase via a luminescent assay - Set 2
IC50
35800±n/a nM
Citation
 PubChem, PC Dose Response confirmation of uHTS hits from a small molecule inhibitors of human intestinal alkaline phosphatase via a luminescent assay - Set 2 PubChem Bioassay (2010)[AID] 
Target
Name:
Intestinal-type alkaline phosphatase
Synonyms:
ALPI Intestinal alkaline phosphatase | PPBI_HUMAN
Type:
PROTEIN
Mol. Mass.:
56804.94
Organism:
Homo sapiens (Human)
Description:
ChEMBL_1278525
Residue:
528
  
Inhibitor
Name:
BDBM75759
Synonyms:
(4E)-4-(3-bromo-5-ethoxy-4-hydroxybenzylidene)-3-methylisoxazol-5(4H)-one 4-[(Z)-(3-bromo-5-ethoxy-4-keto-cyclohexa-2,5-dien-1-ylidene)methyl]-3-methyl-3-isoxazolin-5-one 4-[(Z)-(3-bromo-5-ethoxy-4-oxocyclohexa-2,5-dien-1-ylidene)methyl]-3-methyl-2H-1,2-oxazol-5-one SMR000558422 | cid_6537416
Type:
Small organic molecule
Emp. Form.:
C13H12BrNO4
Mol. Mass.:
326.143
SMILES:
CCOC1=CC(=Cc2c(C)[nH]oc2=O)C=C(Br)C1=O
: