Target
NACHT, LRR and PYD domains-containing protein 3
Ligand
BDBM76284
Substrate
Meas. Tech.
Dose Response confirmation of uHTS for the identification of inhibitors of NALP3 in yeast using a luminescent assay
IC50
35400±n/a nM
Citation
 PubChem, PC Dose Response confirmation of uHTS for the identification of inhibitors of NALP3 in yeast using a luminescent assay PubChem Bioassay (2010)[AID] 
Target
Name:
NACHT, LRR and PYD domains-containing protein 3
Synonyms:
C1orf7 NALP3 NLRP3 protein PYPAF1
Type:
Enzyme Catalytic Domain
Mol. Mass.:
118173.88
Organism:
Homo sapiens (Human)
Description:
Q96P20
Residue:
1036
  
Inhibitor
Name:
BDBM76284
Synonyms:
1-(4-bromophenyl)-4-phenyl-imidazole MLS001174914 cid_3248065
Type:
Small organic molecule
Emp. Form.:
C15H11BrN2
Mol. Mass.:
299.165
SMILES:
Brc1ccc(cc1)-n1cnc(c1)-c1ccccc1
: