Target
NACHT, LRR and PYD domains-containing protein 3
Ligand
BDBM76298
Substrate
Meas. Tech.
Dose Response confirmation of uHTS for the identification of inhibitors of NALP3 in yeast using a luminescent assay
IC50
8020±n/a nM
Citation
 PubChem, PC Dose Response confirmation of uHTS for the identification of inhibitors of NALP3 in yeast using a luminescent assay PubChem Bioassay (2010)[AID] 
Target
Name:
NACHT, LRR and PYD domains-containing protein 3
Synonyms:
C1orf7 NALP3 NLRP3 protein PYPAF1
Type:
Enzyme Catalytic Domain
Mol. Mass.:
118173.88
Organism:
Homo sapiens (Human)
Description:
Q96P20
Residue:
1036
  
Inhibitor
Name:
BDBM76298
Synonyms:
2-aminopropanoic acid [1-(4-chlorophenyl)-2-methylpropan-2-yl] ester;hydrochloride ALAPROCLATE HYDROCHLORIDE CHEMBL36591 SMR001230852 [1-(4-chlorophenyl)-2-methylpropan-2-yl] 2-aminopropanoate;hydrochloride | cid_11957454
Type:
Small organic molecule
Emp. Form.:
C13H18ClNO2
Mol. Mass.:
255.741
SMILES:
CC(N)C(=O)OC(C)(C)Cc1ccc(Cl)cc1
: