Target
NACHT, LRR and PYD domains-containing protein 3
Ligand
BDBM76288
Substrate
Meas. Tech.
Dose Response confirmation of inhibitors of NALP3 in yeast using a Caspase-1-ASC counter screen
IC50
2930±n/a nM
Citation
 PubChem, PC Dose Response confirmation of inhibitors of NALP3 in yeast using a Caspase-1-ASC counter screen PubChem Bioassay (2010)[AID] 
Target
Name:
NACHT, LRR and PYD domains-containing protein 3
Synonyms:
C1orf7 NALP3 NLRP3 protein PYPAF1
Type:
Enzyme Catalytic Domain
Mol. Mass.:
118173.88
Organism:
Homo sapiens (Human)
Description:
Q96P20
Residue:
1036
  
Inhibitor
Name:
BDBM76288
Synonyms:
MLS001075530 N-[[(4-propoxybenzoyl)amino]thiocarbamoyl]thiophene-2-carboxamide N-[[[oxo-(4-propoxyphenyl)methyl]hydrazo]-sulfanylidenemethyl]-2-thiophenecarboxamide cid_1933111
Type:
Small organic molecule
Emp. Form.:
C16H17N3O3S2
Mol. Mass.:
363.454
SMILES:
CCCOc1ccc(cc1)C(=O)NNC(=S)NC(=O)c1cccs1
: