Target
Ammonium transporter MEP2
Ligand
BDBM76252
Substrate
Meas. Tech.
Confirmatory Cherry Pick 3 SAR Dose Response Multiplex in TOR pathway GFP-fusion proteins for Saccharomyes cerevisiae, specifically MEP2
EC50
74380±n/a nM
Citation
 PubChem, PC Confirmatory Cherry Pick 3 SAR Dose Response Multiplex in TOR pathway GFP-fusion proteins for Saccharomyes cerevisiae, specifically MEP2 PubChem Bioassay (2011)[AID] 
Target
Name:
Ammonium transporter MEP2
Synonyms:
AMT2 MEP2_YEAST
Type:
Enzyme Catalytic Domain
Mol. Mass.:
53401.07
Organism:
Saccharomyces cerevisiae
Description:
gi_1302091
Residue:
499
  
Inhibitor
Name:
BDBM76252
Synonyms:
(6-amino-5-nitro-pyrimidin-4-yl)-(3,5-dichlorophenyl)amine MLS000581561 N4-(3,5-dichlorophenyl)-5-nitropyrimidine-4,6-diamine SMR000200189 | cid_2959050
Type:
Small organic molecule
Emp. Form.:
C10H7Cl2N5O2
Mol. Mass.:
300.101
SMILES:
Nc1ncnc(Nc2cc(Cl)cc(Cl)c2)c1[N+]([O-])=O
: