Target
Intestinal-type alkaline phosphatase
Ligand
BDBM75623
Substrate
Meas. Tech.
Dose Response concentration confirmation of uHTS hits from a small molecule activators of human intestinal alkaline phosphatase via a luminescent assay - Set 2
EC50
28400±n/a nM
Citation
 PubChem, PC Dose Response concentration confirmation of uHTS hits from a small molecule activators of human intestinal alkaline phosphatase via a luminescent assay - Set 2 PubChem Bioassay (2010)[AID] 
Target
Name:
Intestinal-type alkaline phosphatase
Synonyms:
ALPI Intestinal alkaline phosphatase | PPBI_HUMAN
Type:
PROTEIN
Mol. Mass.:
56804.94
Organism:
Homo sapiens (Human)
Description:
ChEMBL_1278525
Residue:
528
  
Inhibitor
Name:
BDBM75623
Synonyms:
MLS000569184 N-tert-butyl-2-keto-2-[N'-(2-phenoxyacetyl)hydrazino]acetamide N-tert-butyl-2-oxo-2-[(1-oxo-2-phenoxyethyl)hydrazo]acetamide SMR000175154 | cid_3108518
Type:
Small organic molecule
Emp. Form.:
C14H19N3O4
Mol. Mass.:
293.3184
SMILES:
CC(C)(C)NC(=O)C(=O)NNC(=O)COc1ccccc1
: