Target
Intestinal-type alkaline phosphatase
Ligand
BDBM58625
Substrate
Meas. Tech.
Dose Response concentration confirmation of uHTS hits from a small molecule activators of human intestinal alkaline phosphatase via a luminescent assay - Set 2
EC50
17700±n/a nM
Citation
 PubChem, PC Dose Response concentration confirmation of uHTS hits from a small molecule activators of human intestinal alkaline phosphatase via a luminescent assay - Set 2 PubChem Bioassay (2010)[AID] 
Target
Name:
Intestinal-type alkaline phosphatase
Synonyms:
ALPI Intestinal alkaline phosphatase | PPBI_HUMAN
Type:
PROTEIN
Mol. Mass.:
56804.94
Organism:
Homo sapiens (Human)
Description:
ChEMBL_1278525
Residue:
528
  
Inhibitor
Name:
BDBM58625
Synonyms:
MLS000923798 N'-[3-[(5Z)-5-[(2-chlorophenyl)methylidene]-4-oxidanylidene-2-sulfanylidene-1,3-thiazolidin-3-yl]propanoyl]-2-oxidanyl-benzohydrazide N'-[3-[(5Z)-5-[(2-chlorophenyl)methylidene]-4-oxo-2-sulfanylidene-3-thiazolidinyl]-1-oxopropyl]-2-hydroxybenzohydrazide cid_1566194
Type:
Small organic molecule
Emp. Form.:
C20H16ClN3O4S2
Mol. Mass.:
461.942
SMILES:
Oc1ccccc1C(=O)NNC(=O)CCN1C(=S)S\C(=C/c2ccccc2Cl)C1=O
: