Target
Intestinal-type alkaline phosphatase
Ligand
BDBM75701
Substrate
Meas. Tech.
Dose Response concentration confirmation of uHTS hits from a small molecule activators of human intestinal alkaline phosphatase via a luminescent assay - Set 2
EC50
23500±n/a nM
Citation
 PubChem, PC Dose Response concentration confirmation of uHTS hits from a small molecule activators of human intestinal alkaline phosphatase via a luminescent assay - Set 2 PubChem Bioassay (2010)[AID] 
Target
Name:
Intestinal-type alkaline phosphatase
Synonyms:
ALPI Intestinal alkaline phosphatase | PPBI_HUMAN
Type:
PROTEIN
Mol. Mass.:
56804.94
Organism:
Homo sapiens (Human)
Description:
ChEMBL_1278525
Residue:
528
  
Inhibitor
Name:
BDBM75701
Synonyms:
3-[[(2-hydroxybenzoyl)amino]carbamoyl]-N-(3-methylphenyl)benzenesulfonamide 3-[[[(2-hydroxyphenyl)-oxomethyl]hydrazo]-oxomethyl]-N-(3-methylphenyl)benzenesulfonamide N-(m-tolyl)-3-[(salicyloylamino)carbamoyl]benzenesulfonamide cid_25163558
Type:
Small organic molecule
Emp. Form.:
C21H19N3O5S
Mol. Mass.:
425.458
SMILES:
Cc1cccc(NS(=O)(=O)c2cccc(c2)C(=O)NNC(=O)c2ccccc2O)c1
: