Target
Kappa-type opioid receptor
Ligand
BDBM71578
Substrate
Meas. Tech.
SAR analysis of Antagonists of the Kappa Opioid Receptor (KOR) using an Image-Based Assay - Set 3
IC50
749±n/a nM
Citation
 PubChem, PC SAR analysis of Antagonists of the Kappa Opioid Receptor (KOR) using an Image-Based Assay - Set 3 PubChem Bioassay (2010)[AID] 
Target
Name:
Kappa-type opioid receptor
Synonyms:
K-OR-1 Kappa-opioid receptor (KOR) Kappa-type opioid receptor (KOR) OPIATE Kappa OPRK1 kappa opioid receptor (KOR)
Type:
G Protein-Coupled Receptor (GPCR)
Mol. Mass.:
42648.76
Organism:
Homo sapiens (Human)
Description:
P41145
Residue:
380
  
Inhibitor
Name:
BDBM71578
Synonyms:
4-[[(4-ethylphenyl)sulfonylamino]methyl]-N-[2-[methyl-[(1S)-1-phenylethyl]amino]ethyl]benzamide KUC104158N | cid_46863874
Type:
Small organic molecule
Emp. Form.:
C27H33N3O3S
Mol. Mass.:
479.634
SMILES:
CCc1ccc(cc1)S(=O)(=O)NCc1ccc(cc1)C(=O)NCCN(C)[C@@H](C)c1ccccc1
: