Target
Kappa-type opioid receptor
Ligand
BDBM71599
Substrate
Meas. Tech.
SAR analysis of Antagonists of the Kappa Opioid Receptor (KOR) using an Image-Based Assay - Set 3
IC50
>32000±n/a nM
Citation
 PubChem, PC SAR analysis of Antagonists of the Kappa Opioid Receptor (KOR) using an Image-Based Assay - Set 3 PubChem Bioassay (2010)[AID] 
Target
Name:
Kappa-type opioid receptor
Synonyms:
K-OR-1 Kappa-opioid receptor (KOR) Kappa-type opioid receptor (KOR) OPIATE Kappa OPRK1 kappa opioid receptor (KOR)
Type:
G Protein-Coupled Receptor (GPCR)
Mol. Mass.:
42648.76
Organism:
Homo sapiens (Human)
Description:
P41145
Residue:
380
  
Inhibitor
Name:
BDBM71599
Synonyms:
KSC-1-181 cid_22553433
Type:
Small organic molecule
Emp. Form.:
C20H25N5O2
Mol. Mass.:
367.4448
SMILES:
O=C(Cn1c2ncccc2n2cccc2c1=O)NCCCN1CCCCC1
: