Target
Mu-type opioid receptor
Ligand
BDBM75391
Substrate
Meas. Tech.
SAR Analysis of Agonists of the MOR Receptor using an Image-Based Assay - Set 3
EC50
>32000±n/a nM
Citation
 PubChem, PC SAR Analysis of Agonists of the MOR Receptor using an Image-Based Assay - Set 3 PubChem Bioassay (2010)[AID] 
Target
Name:
Mu-type opioid receptor
Synonyms:
M-OR-1 MOR-1 MUOR1 Mu opiate receptor OPRM1 hMOP | mu-type opioid receptor isoform MOR-1
Type:
G Protein-Coupled Receptor (GPCR)
Mol. Mass.:
44789.51
Organism:
Homo sapiens (Human)
Description:
P35372
Residue:
400
  
Inhibitor
Name:
BDBM75391
Synonyms:
4-[[[5-(2-pyridinyl)-4-(thiophen-2-ylmethyl)-1,2,4-triazol-3-yl]thio]methyl]benzoic acid methyl ester KSC-5-289F4 cid_44620922 | methyl 4-[[5-pyridin-2-yl-4-(thiophen-2-ylmethyl)-1,2,4-triazol-3-yl]sulfanylmethyl]benzoate
Type:
Small organic molecule
Emp. Form.:
C21H18N4O2S2
Mol. Mass.:
422.523
SMILES:
COC(=O)c1ccc(CSc2nnc(-c3ccccn3)n2Cc2cccs2)cc1
: