Target
Vacuolar aminopeptidase 1
Ligand
BDBM76302
Substrate
Meas. Tech.
Confirmatory Cherry Pick 3 SAR Dose Response Multiplex in TOR pathway GFP-fusion proteins for Saccharomyes cerevisiae, specifically LAP4
EC50
5385±n/a nM
Citation
 PubChem, PC Confirmatory Cherry Pick 3 SAR Dose Response Multiplex in TOR pathway GFP-fusion proteins for Saccharomyes cerevisiae, specifically LAP4 PubChem Bioassay (2011)[AID] 
Target
Name:
Vacuolar aminopeptidase 1
Synonyms:
AMPL_YEAST API YSC1
Type:
Enzyme Catalytic Domain
Mol. Mass.:
57084.90
Organism:
Saccharomyces cerevisiae
Description:
gi_486173
Residue:
514
  
Inhibitor
Name:
BDBM76302
Synonyms:
5,7-bis(chloranyl)-2-methyl-quinolin-8-ol 5,7-dichloro-2-methyl-quinolin-8-ol CHLORQUINALDOL, Chlorquinaldol (5,7-Dichloro-2-methyl-8-quinolinol) SMR001549973 | cid_6301
Type:
Small organic molecule
Emp. Form.:
C10H7Cl2NO
Mol. Mass.:
228.075
SMILES:
Cc1ccc2c(Cl)cc(Cl)c(O)c2n1
: