Target
Delta-type opioid receptor
Ligand
BDBM71621
Substrate
Meas. Tech.
SAR Analysis of Antagonists of the DOR Receptor using an Image-Based Assay - Set 3
IC50
>32000±n/a nM
Citation
 PubChem, PC SAR Analysis of Antagonists of the DOR Receptor using an Image-Based Assay - Set 3 PubChem Bioassay (2010)[AID] 
Target
Name:
Delta-type opioid receptor
Synonyms:
D-OR-1 Delta opioid receptor OPIATE Delta OPRD1 OPRK1 | opioid receptor, delta 1
Type:
G Protein-Coupled Receptor (GPCR)
Mol. Mass.:
40382.98
Organism:
Homo sapiens (Human)
Description:
Competition binding assays were carried out using membrane preparations from transfected HN9.10 cells that constitutively expressed the delta opioid receptor.
Residue:
372
  
Inhibitor
Name:
BDBM71621
Synonyms:
KSC-1-282 cid_45100477
Type:
Small organic molecule
Emp. Form.:
C27H31BrN6O4
Mol. Mass.:
583.477
SMILES:
COc1ccc(N2CCN(CCCNC(=O)Cn3c4ncc(Br)cc4n4cccc4c3=O)CC2)c(OC)c1
: