Target
Mu-type opioid receptor
Ligand
BDBM71582
Substrate
Meas. Tech.
SAR Analysis of Antagonists of the MOR Receptor using an Image-Based Assay - Set 3
IC50
>32000±n/a nM
Citation
 PubChem, PC SAR Analysis of Antagonists of the MOR Receptor using an Image-Based Assay - Set 3 PubChem Bioassay (2010)[AID] 
Target
Name:
Mu-type opioid receptor
Synonyms:
M-OR-1 MOR-1 MUOR1 Mu opiate receptor OPRM1 hMOP | mu-type opioid receptor isoform MOR-1
Type:
G Protein-Coupled Receptor (GPCR)
Mol. Mass.:
44789.51
Organism:
Homo sapiens (Human)
Description:
P35372
Residue:
400
  
Inhibitor
Name:
BDBM71582
Synonyms:
KSC-5-280D N-[2-[(4-methylphenyl)methyl-propan-2-yl-amino]ethyl]-4-[[(4-methylphenyl)sulfonylamino]methyl]benzamide N-[2-[isopropyl-(4-methylbenzyl)amino]ethyl]-4-[(tosylamino)methyl]benzamide | cid_44620902
Type:
Small organic molecule
Emp. Form.:
C28H35N3O3S
Mol. Mass.:
493.661
SMILES:
CC(C)N(CCNC(=O)c1ccc(CNS(=O)(=O)c2ccc(C)cc2)cc1)Cc1ccc(C)cc1
: