Target
Mu-type opioid receptor
Ligand
BDBM75571
Substrate
Meas. Tech.
SAR Analysis of Antagonists of the MOR Receptor using an Image-Based Assay - Set 3
IC50
>32000±n/a nM
Citation
 PubChem, PC SAR Analysis of Antagonists of the MOR Receptor using an Image-Based Assay - Set 3 PubChem Bioassay (2010)[AID] 
Target
Name:
Mu-type opioid receptor
Synonyms:
M-OR-1 MOR-1 MUOR1 Mu opiate receptor OPRM1 hMOP | mu-type opioid receptor isoform MOR-1
Type:
G Protein-Coupled Receptor (GPCR)
Mol. Mass.:
44789.51
Organism:
Homo sapiens (Human)
Description:
P35372
Residue:
400
  
Inhibitor
Name:
BDBM75571
Synonyms:
4-[[(4-tert-butylphenyl)sulfonylamino]methyl]-N-[2-[(phenylmethyl)-propan-2-yl-amino]ethyl]benzamide KSC-11-129-1 N-[2-[benzyl(isopropyl)amino]ethyl]-4-[[(4-tert-butylphenyl)sulfonylamino]methyl]benzamide cid_45115588
Type:
Small organic molecule
Emp. Form.:
C30H39N3O3S
Mol. Mass.:
521.714
SMILES:
CC(C)N(CCNC(=O)c1ccc(CNS(=O)(=O)c2ccc(cc2)C(C)(C)C)cc1)Cc1ccccc1
: