Target
NACHT, LRR and PYD domains-containing protein 1
Ligand
BDBM76310
Substrate
Meas. Tech.
Dose Response confirmation of uHTS for the identification of inhibitors of NALP1 in yeast using a luminescent assay
IC50
10200±n/a nM
Citation
 PubChem, PC Dose Response confirmation of uHTS for the identification of inhibitors of NALP1 in yeast using a luminescent assay PubChem Bioassay (2010)[AID] 
Target
Name:
NACHT, LRR and PYD domains-containing protein 1
Synonyms:
CARD7 KIAA0926 NACHT, LRR and PYD domains-containing protein 1 isoform 1 NLRP1 | NLRP1_HUMAN
Type:
Enzyme Catalytic Domain
Mol. Mass.:
165873.33
Organism:
Homo sapiens (Human)
Description:
Q9C000
Residue:
1473
  
Inhibitor
Name:
BDBM76310
Synonyms:
2-Phenyl-1-(4-propoxy-phenyl)-3-pyrrolidin-1-yl-propan-1-one 2-phenyl-1-(4-propoxyphenyl)-3-pyrrolidin-1-yl-propan-1-one;hydrochloride 2-phenyl-1-(4-propoxyphenyl)-3-pyrrolidino-propan-1-one;hydrochloride SMR000145951 | cid_9550023
Type:
Small organic molecule
Emp. Form.:
C22H27NO2
Mol. Mass.:
337.4553
SMILES:
CCCOc1ccc(cc1)C(=O)C(CN1CCCC1)c1ccccc1
: