Target
NACHT, LRR and PYD domains-containing protein 1
Ligand
BDBM61638
Substrate
Meas. Tech.
Dose Response confirmation of uHTS for the identification of inhibitors of NALP1 in yeast using a luminescent assay
IC50
14300±n/a nM
Citation
 PubChem, PC Dose Response confirmation of uHTS for the identification of inhibitors of NALP1 in yeast using a luminescent assay PubChem Bioassay (2010)[AID] 
Target
Name:
NACHT, LRR and PYD domains-containing protein 1
Synonyms:
CARD7 KIAA0926 NACHT, LRR and PYD domains-containing protein 1 isoform 1 NLRP1 | NLRP1_HUMAN
Type:
Enzyme Catalytic Domain
Mol. Mass.:
165873.33
Organism:
Homo sapiens (Human)
Description:
Q9C000
Residue:
1473
  
Inhibitor
Name:
BDBM61638
Synonyms:
(E)-2-cyano-3-(5-nitro-2-furanyl)-N-(1-phenylethyl)-2-propenamide (E)-2-cyano-3-(5-nitrofuran-2-yl)-N-(1-phenylethyl)prop-2-enamide SMR000590532 | cid_6393553
Type:
Small organic molecule
Emp. Form.:
C16H13N3O4
Mol. Mass.:
311.2921
SMILES:
CC(NC(=O)C(=C\c1ccc(o1)[N+]([O-])=O)\C#N)c1ccccc1
: