Target
Caspase-1
Ligand
BDBM76329
Substrate
Meas. Tech.
Dose Response confirmation of inhibitors of NALP1 in yeast using a Caspase-1-ASC counter screen.
IC50
15000±n/a nM
Citation
 PubChem, PC Dose Response confirmation of inhibitors of NALP1 in yeast using a Caspase-1-ASC counter screen. PubChem Bioassay (2010)[AID] 
Target
Name:
Caspase-1
Synonyms:
CASP1 Caspase ICE IL1BCE Interleukin-1 beta-converting enzyme
Type:
Enzyme
Mol. Mass.:
45154.13
Organism:
Homo sapiens (Human)
Description:
P29466
Residue:
404
  
Inhibitor
Name:
BDBM76329
Synonyms:
2-methyl-N-(5-thiophen-2-yl-1,3,4-thiadiazol-2-yl)-2-propenamide 2-methyl-N-[5-(2-thienyl)-1,3,4-thiadiazol-2-yl]acrylamide SMR000272413 | cid_898899
Type:
Small organic molecule
Emp. Form.:
C10H9N3OS2
Mol. Mass.:
251.328
SMILES:
CC(=C)C(=O)Nc1nnc(s1)-c1cccs1
: