Target
Type-1 angiotensin II receptor
Ligand
BDBM76134
Substrate
Meas. Tech.
Dose Response screen for agonists of Angiotensin II Receptor Type 1 to assess selectivity of uHTS small molecule agonists hits of the APJ receptor
EC50
>100000±n/a nM
Citation
 PubChem, PC Dose Response screen for agonists of Angiotensin II Receptor Type 1 to assess selectivity of uHTS small molecule agonists hits of the APJ receptor PubChem Bioassay (2010)[AID] 
Target
Name:
Type-1 angiotensin II receptor
Synonyms:
AGTR1 AGTR1B AT1 AT1BR AT2R1B Angiotensin II receptor Type-1 angiotensin II receptor (AT1)
Type:
Protein
Mol. Mass.:
41080.75
Organism:
Homo sapiens (Human)
Description:
P30556
Residue:
359
  
Inhibitor
Name:
BDBM76134
Synonyms:
4-(6,7-diethoxy-4-keto-2-thioxo-1H-quinazolin-3-yl)-N-(2-pyridylmethyl)butyramide 4-(6,7-diethoxy-4-oxo-2-sulfanylidene-1H-quinazolin-3-yl)-N-(2-pyridinylmethyl)butanamide MLS001029364 cid_4339959
Type:
Small organic molecule
Emp. Form.:
C22H26N4O4S
Mol. Mass.:
442.531
SMILES:
CCOc1cc2[nH]c(=S)n(CCCC(=O)NCc3ccccn3)c(=O)c2cc1OCC
: