Target
Type-1 angiotensin II receptor
Ligand
BDBM66946
Substrate
Meas. Tech.
Dose Response screen for agonists of Angiotensin II Receptor Type 1 to assess selectivity of uHTS small molecule agonists hits of the APJ receptor
EC50
>100000±n/a nM
Citation
 PubChem, PC Dose Response screen for agonists of Angiotensin II Receptor Type 1 to assess selectivity of uHTS small molecule agonists hits of the APJ receptor PubChem Bioassay (2010)[AID] 
Target
Name:
Type-1 angiotensin II receptor
Synonyms:
AGTR1 AGTR1B AT1 AT1BR AT2R1B Angiotensin II receptor Type-1 angiotensin II receptor (AT1)
Type:
Protein
Mol. Mass.:
41080.75
Organism:
Homo sapiens (Human)
Description:
P30556
Residue:
359
  
Inhibitor
Name:
BDBM66946
Synonyms:
4-(3,4-dihydro-1H-isoquinolin-2-ylsulfonyl)-N-[3-(dimethylamino)propyl]-N-(6-fluoranyl-1,3-benzothiazol-2-yl)benzamide;hydrochloride MLS001239379 cid_24892079
Type:
Small organic molecule
Emp. Form.:
C28H29FN4O3S2
Mol. Mass.:
552.683
SMILES:
CN(C)CCCN(C(=O)c1ccc(cc1)S(=O)(=O)N1CCc2ccccc2C1)c1nc2ccc(F)cc2s1
: