Target
Intestinal-type alkaline phosphatase
Ligand
BDBM39759
Substrate
Meas. Tech.
Dose Response confirmation of uHTS activators of Mouse Intestinal Alkaline Phosphatase using Human Intestinal Alkaline Phosphatase
EC50
>100000±n/a nM
Citation
 PubChem, PC Dose Response confirmation of uHTS activators of Mouse Intestinal Alkaline Phosphatase using Human Intestinal Alkaline Phosphatase PubChem Bioassay (2010)[AID] 
Target
Name:
Intestinal-type alkaline phosphatase
Synonyms:
ALPI Intestinal alkaline phosphatase | PPBI_HUMAN
Type:
PROTEIN
Mol. Mass.:
56804.94
Organism:
Homo sapiens (Human)
Description:
ChEMBL_1278525
Residue:
528
  
Inhibitor
Name:
BDBM39759
Synonyms:
2-[[5-(1,3-benzothiazol-2-ylsulfanylmethyl)-4-ethyl-1,2,4-triazol-3-yl]sulfanyl]-1-(3,4-dihydroxyphenyl)ethanone 2-[[5-[(1,3-benzothiazol-2-ylthio)methyl]-4-ethyl-1,2,4-triazol-3-yl]thio]-1-(3,4-dihydroxyphenyl)ethanone SMR000152983 | cid_2102207
Type:
Small organic molecule
Emp. Form.:
C20H18N4O3S3
Mol. Mass.:
458.577
SMILES:
CCn1c(CSc2nc3ccccc3s2)nnc1SCC(=O)c1ccc(O)c(O)c1
: