Target
Intestinal-type alkaline phosphatase
Ligand
BDBM60951
Substrate
Meas. Tech.
Dose Response confirmation of uHTS activators of Mouse Intestinal Alkaline Phosphatase using Human Intestinal Alkaline Phosphatase
EC50
>100000±n/a nM
Citation
 PubChem, PC Dose Response confirmation of uHTS activators of Mouse Intestinal Alkaline Phosphatase using Human Intestinal Alkaline Phosphatase PubChem Bioassay (2010)[AID] 
Target
Name:
Intestinal-type alkaline phosphatase
Synonyms:
ALPI Intestinal alkaline phosphatase | PPBI_HUMAN
Type:
PROTEIN
Mol. Mass.:
56804.94
Organism:
Homo sapiens (Human)
Description:
ChEMBL_1278525
Residue:
528
  
Inhibitor
Name:
BDBM60951
Synonyms:
MLS001158810 N-(1,1-dioxo-3-thiolanyl)-2-[(5Z)-5-(2-furanylmethylidene)-4-oxo-2-sulfanylidene-3-thiazolidinyl]acetamide N-[1,1-bis(oxidanylidene)thiolan-3-yl]-2-[(5Z)-5-(furan-2-ylmethylidene)-4-oxidanylidene-2-sulfanylidene-1,3-thiazolidin-3-yl]ethanamide cid_6237092
Type:
Small organic molecule
Emp. Form.:
C14H14N2O5S3
Mol. Mass.:
386.466
SMILES:
O=C(CN1C(=S)S\C(=C/c2ccco2)C1=O)NC1CCS(=O)(=O)C1
: