Target
Intestinal-type alkaline phosphatase
Ligand
BDBM4293
Substrate
Meas. Tech.
Dose Response confirmation of uHTS activators of Mouse Intestinal Alkaline Phosphatase using Human Intestinal Alkaline Phosphatase
EC50
6360±n/a nM
Citation
 PubChem, PC Dose Response confirmation of uHTS activators of Mouse Intestinal Alkaline Phosphatase using Human Intestinal Alkaline Phosphatase PubChem Bioassay (2010)[AID] 
Target
Name:
Intestinal-type alkaline phosphatase
Synonyms:
ALPI Intestinal alkaline phosphatase | PPBI_HUMAN
Type:
PROTEIN
Mol. Mass.:
56804.94
Organism:
Homo sapiens (Human)
Description:
ChEMBL_1278525
Residue:
528
  
Inhibitor
Name:
BDBM4293
Synonyms:
(2E)-3-(3,4-dihydroxyphenyl)-2-[(3,4-dihydroxyphenyl)carbonyl]prop-2-enenitrile Tyrphostin deriv. 24 | cid_5328760
Type:
Small organic molecule
Emp. Form.:
C16H11NO5
Mol. Mass.:
297.2622
SMILES:
Oc1ccc(\C=C(/C#N)C(=O)c2ccc(O)c(O)c2)cc1O
: