Target
Intestinal-type alkaline phosphatase 1
Ligand
BDBM39724
Substrate
Meas. Tech.
Dose Response confirmation of uHTS inhibitors of Human Intestinal Alkaline Phosphatase using Mouse Intestinal Alkaline Phosphatase
IC50
>100000±n/a nM
Citation
 PubChem, PC Dose Response confirmation of uHTS inhibitors of Human Intestinal Alkaline Phosphatase using Mouse Intestinal Alkaline Phosphatase PubChem Bioassay (2010)[AID] 
Target
Name:
Intestinal-type alkaline phosphatase 1
Synonyms:
Alpi | PPBI1_RAT
Type:
Enzyme Catalytic Domain
Mol. Mass.:
58396.39
Organism:
Rattus norvegicus (Rat)
Description:
P15693
Residue:
540
  
Inhibitor
Name:
BDBM39724
Synonyms:
4-(2-benzylsulfanylethyl)pyridine;phosphoric acid 4-[2-(benzylthio)ethyl]pyridine;phosphoric acid 4-[2-(phenylmethylthio)ethyl]pyridine;phosphoric acid SMR000137553 | cid_2827182
Type:
Small organic molecule
Emp. Form.:
C14H15NS
Mol. Mass.:
229.341
SMILES:
C(Cc1ccncc1)SCc1ccccc1
: