Target
Intestinal-type alkaline phosphatase 1
Ligand
BDBM50210
Substrate
Meas. Tech.
Dose Response confirmation of uHTS inhibitors of Human Intestinal Alkaline Phosphatase using Mouse Intestinal Alkaline Phosphatase
IC50
>100000±n/a nM
Citation
 PubChem, PC Dose Response confirmation of uHTS inhibitors of Human Intestinal Alkaline Phosphatase using Mouse Intestinal Alkaline Phosphatase PubChem Bioassay (2010)[AID] 
Target
Name:
Intestinal-type alkaline phosphatase 1
Synonyms:
Alpi | PPBI1_RAT
Type:
Enzyme Catalytic Domain
Mol. Mass.:
58396.39
Organism:
Rattus norvegicus (Rat)
Description:
P15693
Residue:
540
  
Inhibitor
Name:
BDBM50210
Synonyms:
4-Methyl-5-oxo-4,5-dihydro-1H-pyrazole-3-carboxylic acid (2,4-dihydroxy-benzylidene)-hydrazide MLS000553611 N'-[(E)-(2-hydroxy-4-oxo-1-cyclohexa-2,5-dienylidene)methyl]-4-methyl-5-oxo-1,4-dihydropyrazole-3-carbohydrazide SMR000171667 | cid_5759606
Type:
Small organic molecule
Emp. Form.:
C12H12N4O4
Mol. Mass.:
276.2481
SMILES:
Cc1c([nH][nH]c1=O)C(=O)NN=Cc1ccc(O)cc1O
: