Target
Intestinal-type alkaline phosphatase 1
Ligand
BDBM65353
Substrate
Meas. Tech.
Dose Response confirmation of uHTS inhibitors of Human Intestinal Alkaline Phosphatase using Mouse Intestinal Alkaline Phosphatase
IC50
73800±n/a nM
Citation
 PubChem, PC Dose Response confirmation of uHTS inhibitors of Human Intestinal Alkaline Phosphatase using Mouse Intestinal Alkaline Phosphatase PubChem Bioassay (2010)[AID] 
Target
Name:
Intestinal-type alkaline phosphatase 1
Synonyms:
Alpi | PPBI1_RAT
Type:
Enzyme Catalytic Domain
Mol. Mass.:
58396.39
Organism:
Rattus norvegicus (Rat)
Description:
P15693
Residue:
540
  
Inhibitor
Name:
BDBM65353
Synonyms:
4-bromanyl-N'-[(E)-(4-ethoxy-6-oxidanylidene-cyclohexa-2,4-dien-1-ylidene)methyl]-1H-pyrazole-5-carbohydrazide 4-bromo-N'-[(E)-(4-ethoxy-6-oxo-1-cyclohexa-2,4-dienylidene)methyl]-1H-pyrazole-5-carbohydrazide MLS000716288 cid_5923073
Type:
Small organic molecule
Emp. Form.:
C13H13BrN4O3
Mol. Mass.:
353.171
SMILES:
CCOc1ccc(C=NNC(=O)c2[nH]ncc2Br)c(O)c1
: