Target
Intestinal-type alkaline phosphatase 1
Ligand
BDBM66136
Substrate
Meas. Tech.
Dose Response confirmation of uHTS inhibitors of Human Intestinal Alkaline Phosphatase using Mouse Intestinal Alkaline Phosphatase
IC50
20300±n/a nM
Citation
 PubChem, PC Dose Response confirmation of uHTS inhibitors of Human Intestinal Alkaline Phosphatase using Mouse Intestinal Alkaline Phosphatase PubChem Bioassay (2010)[AID] 
Target
Name:
Intestinal-type alkaline phosphatase 1
Synonyms:
Alpi | PPBI1_RAT
Type:
Enzyme Catalytic Domain
Mol. Mass.:
58396.39
Organism:
Rattus norvegicus (Rat)
Description:
P15693
Residue:
540
  
Inhibitor
Name:
BDBM66136
Synonyms:
2-amino-5-(3-hydroxy-6-keto-xanthen-9-yl)benzoic acid 2-amino-5-(3-hydroxy-6-oxoxanthen-9-yl)benzoic acid MLS001216583 cid_3801816
Type:
Small organic molecule
Emp. Form.:
C20H13NO5
Mol. Mass.:
347.3209
SMILES:
Nc1ccc(cc1C(O)=O)-c1c2ccc(O)cc2oc2cc(=O)ccc12
: