Target
Intestinal-type alkaline phosphatase 1
Ligand
BDBM75697
Substrate
Meas. Tech.
Dose Response confirmation of uHTS inhibitors of Human Intestinal Alkaline Phosphatase using Mouse Intestinal Alkaline Phosphatase
IC50
89400±n/a nM
Citation
 PubChem, PC Dose Response confirmation of uHTS inhibitors of Human Intestinal Alkaline Phosphatase using Mouse Intestinal Alkaline Phosphatase PubChem Bioassay (2010)[AID] 
Target
Name:
Intestinal-type alkaline phosphatase 1
Synonyms:
Alpi | PPBI1_RAT
Type:
Enzyme Catalytic Domain
Mol. Mass.:
58396.39
Organism:
Rattus norvegicus (Rat)
Description:
P15693
Residue:
540
  
Inhibitor
Name:
BDBM75697
Synonyms:
MLS002163808 N-[3-[2-[2-(4-bromophenoxy)acetyl]hydrazinyl]-3-oxopropyl]-3,4-dimethylbenzenesulfonamide N-[3-[[2-(4-bromophenoxy)-1-oxoethyl]hydrazo]-3-oxopropyl]-3,4-dimethylbenzenesulfonamide cid_2542414
Type:
Small organic molecule
Emp. Form.:
C19H22BrN3O5S
Mol. Mass.:
484.364
SMILES:
Cc1ccc(cc1C)S(=O)(=O)NCCC(=O)NNC(=O)COc1ccc(Br)cc1
: