Target
Intestinal-type alkaline phosphatase 1
Ligand
BDBM75749
Substrate
Meas. Tech.
Dose Response confirmation of uHTS activators of Human Intestinal Alkaline Phosphatase using Mouse Intestinal Alkaline Phosphatase
EC50
>100000±n/a nM
Citation
 PubChem, PC Dose Response confirmation of uHTS activators of Human Intestinal Alkaline Phosphatase using Mouse Intestinal Alkaline Phosphatase PubChem Bioassay (2010)[AID] 
Target
Name:
Intestinal-type alkaline phosphatase 1
Synonyms:
Alpi | PPBI1_RAT
Type:
Enzyme Catalytic Domain
Mol. Mass.:
58396.39
Organism:
Rattus norvegicus (Rat)
Description:
P15693
Residue:
540
  
Inhibitor
Name:
BDBM75749
Synonyms:
2-[4-(2-hydroxyethyl)-3-methyl-5-oxo-2,5-dihydro-1H-pyrazol-1-yl]-6-phenyl-4(3H)-pyrimidinone 2-[4-(2-hydroxyethyl)-5-methyl-3-oxidanylidene-1H-pyrazol-2-yl]-6-phenyl-1H-pyrimidin-4-one MLS000736229 cid_379752
Type:
Small organic molecule
Emp. Form.:
C16H16N4O3
Mol. Mass.:
312.3232
SMILES:
Cc1[nH]n(-c2nc(cc(=O)[nH]2)-c2ccccc2)c(=O)c1CCO
: