Target
Intestinal-type alkaline phosphatase
Ligand
BDBM75790
Substrate
Meas. Tech.
Dose Response confirmation of uHTS inhibitors of Mouse Intestinal Alkaline Phosphatase using Human Intestinal Alkaline Phosphatase
IC50
21300±n/a nM
Citation
 PubChem, PC Dose Response confirmation of uHTS inhibitors of Mouse Intestinal Alkaline Phosphatase using Human Intestinal Alkaline Phosphatase PubChem Bioassay (2010)[AID] 
Target
Name:
Intestinal-type alkaline phosphatase
Synonyms:
ALPI Intestinal alkaline phosphatase | PPBI_HUMAN
Type:
PROTEIN
Mol. Mass.:
56804.94
Organism:
Homo sapiens (Human)
Description:
ChEMBL_1278525
Residue:
528
  
Inhibitor
Name:
BDBM75790
Synonyms:
3-[(4-hydroxy-3-methoxybenzylidene)amino]-2-thioxo-1,3-thiazolidin-4-one 3-[[(E)-(3-methoxy-4-oxo-1-cyclohexa-2,5-dienylidene)methyl]amino]-2-sulfanylidene-4-thiazolidinone 3-[[(E)-(4-keto-3-methoxy-cyclohexa-2,5-dien-1-ylidene)methyl]amino]-2-thioxo-thiazolidin-4-one SMR000135418 | cid_5342649
Type:
Small organic molecule
Emp. Form.:
C11H10N2O3S2
Mol. Mass.:
282.339
SMILES:
COc1cc(C=Nn2c(O)csc2=S)ccc1O
: