Target
Intestinal-type alkaline phosphatase
Ligand
BDBM76171
Substrate
Meas. Tech.
Dose Response confirmation of uHTS inhibitors of Mouse Intestinal Alkaline Phosphatase using Human Intestinal Alkaline Phosphatase
IC50
>100000±n/a nM
Citation
 PubChem, PC Dose Response confirmation of uHTS inhibitors of Mouse Intestinal Alkaline Phosphatase using Human Intestinal Alkaline Phosphatase PubChem Bioassay (2010)[AID] 
Target
Name:
Intestinal-type alkaline phosphatase
Synonyms:
ALPI Intestinal alkaline phosphatase | PPBI_HUMAN
Type:
PROTEIN
Mol. Mass.:
56804.94
Organism:
Homo sapiens (Human)
Description:
ChEMBL_1278525
Residue:
528
  
Inhibitor
Name:
BDBM76171
Synonyms:
(2E,6E)-2,6-bis(3-chloro-5-ethoxy-4-hydroxy-benzylidene)cyclohexanone (2E,6E)-2,6-bis[(3-chloro-5-ethoxy-4-hydroxyphenyl)methylidene]-1-cyclohexanone 2,6-bis(3-chloro-5-ethoxy-4-hydroxybenzylidene)cyclohexanone SMR000162201 | cid_1751796
Type:
Small organic molecule
Emp. Form.:
C24H24Cl2O5
Mol. Mass.:
463.35
SMILES:
CCOc1cc(\C=C2/CCC\C(=C/c3cc(Cl)c(O)c(OCC)c3)C2=O)cc(Cl)c1O
: