Target
Intestinal-type alkaline phosphatase
Ligand
BDBM44110
Substrate
Meas. Tech.
Dose Response confirmation of uHTS inhibitors of Mouse Intestinal Alkaline Phosphatase using Human Intestinal Alkaline Phosphatase
IC50
80000±n/a nM
Citation
 PubChem, PC Dose Response confirmation of uHTS inhibitors of Mouse Intestinal Alkaline Phosphatase using Human Intestinal Alkaline Phosphatase PubChem Bioassay (2010)[AID] 
Target
Name:
Intestinal-type alkaline phosphatase
Synonyms:
ALPI Intestinal alkaline phosphatase | PPBI_HUMAN
Type:
PROTEIN
Mol. Mass.:
56804.94
Organism:
Homo sapiens (Human)
Description:
ChEMBL_1278525
Residue:
528
  
Inhibitor
Name:
BDBM44110
Synonyms:
(5Z)-3-[[(E)-(6-keto-3-nitro-cyclohexa-2,4-dien-1-ylidene)methyl]amino]-5-[(5-methyl-2-furyl)methylene]-2-thioxo-thiazolidin-4-one (5Z)-5-[(5-methylfuran-2-yl)methylidene]-3-[[(E)-(3-nitro-6-oxidanylidene-cyclohexa-2,4-dien-1-ylidene)methyl]amino]-2-sulfanylidene-1,3-thiazolidin-4-one 3-[(2-hydroxy-5-nitrobenzylidene)amino]-5-[(5-methyl-2-furyl)methylene]-2-thioxo-1,3-thiazolidin-4-one SMR000297974 | cid_5891295
Type:
Small organic molecule
Emp. Form.:
C16H11N3O5S2
Mol. Mass.:
389.406
SMILES:
Cc1ccc(\C=C2/SC(=S)N(\[NH+]=C\[c-]3cc(ccc3=O)[N+]([O-])=O)C2=O)o1
: