Target
Intestinal-type alkaline phosphatase
Ligand
BDBM59326
Substrate
Meas. Tech.
Dose Response confirmation of uHTS inhibitors of Mouse Intestinal Alkaline Phosphatase using Human Intestinal Alkaline Phosphatase
IC50
70100±n/a nM
Citation
 PubChem, PC Dose Response confirmation of uHTS inhibitors of Mouse Intestinal Alkaline Phosphatase using Human Intestinal Alkaline Phosphatase PubChem Bioassay (2010)[AID] 
Target
Name:
Intestinal-type alkaline phosphatase
Synonyms:
ALPI Intestinal alkaline phosphatase | PPBI_HUMAN
Type:
PROTEIN
Mol. Mass.:
56804.94
Organism:
Homo sapiens (Human)
Description:
ChEMBL_1278525
Residue:
528
  
Inhibitor
Name:
BDBM59326
Synonyms:
1-(2,4-dimethylphenyl)-2-(4-methyl-6-piperidin-1-yl-pyrimidin-2-yl)guanidine 1-(2,4-dimethylphenyl)-2-(4-methyl-6-piperidino-pyrimidin-2-yl)guanidine MLS000678345 cid_9595162
Type:
Small organic molecule
Emp. Form.:
C19H26N6
Mol. Mass.:
338.4499
SMILES:
Cc1ccc(NC(N)=Nc2nc(C)cc(n2)N2CCCCC2)c(C)c1
: